Error in invoking target ‘agent nmhs’ of makefile

The following errors occurred while install on Linux 7.4.  when relink the binary, the same error will be reported as well.

INFO: collect2: error: ld returned 1 exit status

INFO: make[1]:
INFO: *** [/u01/app/oracle/product/11.2.0/dbhome_1/sysman/lib/emdctl] Error 1

INFO: make[1]: Leaving directory `/u01/app/oracle/product/11.2.0/dbhome_1/sysman/lib'

INFO: make: *** [emdctl] Error 2

INFO: End output from spawned process.
INFO: ----------------------------------
SEVERE: oracle.sysman.oii.oiil.OiilActionException: Error in invoking target 'agent nmhs' of makefile '/u01/app/oracle/product/11.2.0/dbhome_1/sysman/lib/'. See '/u01/app/oracle/product/11.2.0/dbhome_1/install/relinkActions2018-05-25_09-48-55-AM.log' for details.
at oracle.sysman.oii.oiis.OiisMakeDeps.invokeMakefile(
at oracle.sysman.oii.oiis.OiisMakeDeps.doRelink(
at oracle.sysman.oii.oiis.OiisMakeDeps.doOperation(
at oracle.sysman.oii.oiis.OiisMakeDeps.main(


In $ORACLE_HOME/sysman/lib/ file :





Leave a Reply

Fill in your details below or click an icon to log in: Logo

You are commenting using your account. Log Out /  Change )

Facebook photo

You are commenting using your Facebook account. Log Out /  Change )

Connecting to %s

This site uses Akismet to reduce spam. Learn how your comment data is processed.

%d bloggers like this: